level 1
今天编译2.6.34内核,出错,
详细如下
CC kernel/time/clocksource.o
/tmp/ccUjzj1c.s: Assembler messages:
/tmp/ccUjzj1c.s:475: Error: .err encountered
make[2]: *** [kernel/time/clocksource.o] Error 1
make[1]: *** [kernel/time] Error 2
make: *** [kernel] Error 2
遍寻百度,google无果,求哪位高手解答一下。
谢谢!
2010年12月12日 14点12分
1
level 1
是我在make menuconfig时没勾选什么选项吗?
2010年12月12日 14点12分
2
level 1
回复:3楼
谢谢,晚上按照你的说明,下载了4,3,2,
编译通过了。
2010年12月13日 15点12分
4