我去放鞭炮 我去放鞭炮
关注数: 1 粉丝数: 4 发帖数: 104 关注贴吧数: 4
ubuntu12.04 安装有线网卡驱动make时报错 ubuntu12.04 安装有线网卡驱动make时报错: make[1]: 正在进入目录 `/usr/src/linux-headers-3.2.0-57-generic-pae' CC [M] /home/virus/下载/compat-wireless-2012-12-18/compat/main.o In file included from /home/virus/下载/compat-wireless-2012-12-18/include/linux/compat-2.6.h:65:0, from <命令行>:0: /home/virus/下载/compat-wireless-2012-12-18/include/linux/compat-3.4.h:43:21: 错误: ‘kmalloc_array’重定义 include/linux/slab.h:243:21: 附注: ‘kmalloc_array’的上一个定义在此 In file included from /home/virus/下载/compat-wireless-2012-12-18/include/linux/compat-2.6.h:69:0, from <命令行>:0: /home/virus/下载/compat-wireless-2012-12-18/include/linux/compat-3.8.h:10:0: 警告: “HID_USB_DEVICE”重定义 [默认启用] include/linux/hid.h:571:0: 附注: 这是先前定义的位置 /home/virus/下载/compat-wireless-2012-12-18/include/linux/compat-3.8.h:12:0: 警告: “HID_BLUETOOTH_DEVICE”重定义 [默认启用] include/linux/hid.h:572:0: 附注: 这是先前定义的位置 /home/virus/下载/compat-wireless-2012-12-18/include/linux/compat-3.8.h:47:32: 错误: ‘kref_get_unless_zero’重定义 include/linux/kref.h:47:32: 附注: ‘kref_get_unless_zero’的上一个定义在此 make[3]: *** [/home/virus/下载/compat-wireless-2012-12-18/compat/main.o] 错误 1 make[2]: *** [/home/virus/下载/compat-wireless-2012-12-18/compat] 错误 2 make[1]: *** [_module_/home/virus/下载/compat-wireless-2012-12-18] 错误 2 make[1]:正在离开目录 `/usr/src/linux-headers-3.2.0-57-generic-pae' make: *** [modules] 错误 2 瞎搞成功过,不记得怎么搞了,望大神赐教。
1 下一页